version 2020.11.16

7 jobs for master in 22 minutes and 25 seconds (queued for 4 seconds)
Status Job ID Name Coverage
  Test
failed #735
allowed to fail
jython-core

00:02:20

passed #729
py2.7-core

00:00:33

passed #730
py3.6-core

00:00:34

passed #731
py3.7-core

00:00:34

passed #732
py3.8-core

00:00:33

passed #733
py3.9-core

00:00:33

failed #734
allowed to fail
py3.9-download

00:22:23

 
Name Stage Failure
failed
py3.9-download Test

--------------------- >> end captured stdout << ----------------------

----------------------------------------------------------------------
Ran 2143 tests in 1317.159s

FAILED (errors=920, failures=265)
Cleaning up file based variables
ERROR: Job failed: exit code 1
failed
jython-core Test
    raise _map_exception(jlx)
error: [Errno -1] Unmapped exception: java.security.KeyStoreException: Key protection algorithm not found: java.security.KeyStoreException: Certificate chain is not valid

----------------------------------------------------------------------
Ran 172 tests in 84.064s

FAILED (errors=2)
Cleaning up file based variables
ERROR: Job failed: exit code 1