version 2020.11.20

7 jobs for master in 22 minutes and 25 seconds (queued for 2 seconds)
Status Job ID Name Coverage
  Test
failed #790
allowed to fail
jython-core

00:02:20

passed #784
py2.7-core

00:00:32

passed #785
py3.6-core

00:00:32

passed #786
py3.7-core

00:00:31

passed #787
py3.8-core

00:00:31

passed #788
py3.9-core

00:00:31

failed #789
allowed to fail
py3.9-download

00:22:23

 
Name Stage Failure
failed
py3.9-download Test

--------------------- >> end captured stdout << ----------------------

----------------------------------------------------------------------
Ran 2143 tests in 1314.745s

FAILED (errors=933, failures=271)
Cleaning up file based variables
ERROR: Job failed: exit code 1
failed
jython-core Test
    raise _map_exception(jlx)
error: [Errno -1] Unmapped exception: java.security.KeyStoreException: Key protection algorithm not found: java.security.KeyStoreException: Certificate chain is not valid

----------------------------------------------------------------------
Ran 172 tests in 82.049s

FAILED (errors=2)
Cleaning up file based variables
ERROR: Job failed: exit code 1