version 2020.11.27

7 jobs for master in 20 minutes and 39 seconds (queued for 2 seconds)
Status Job ID Name Coverage
  Test
failed #832
allowed to fail
jython-core

00:02:27

passed #826
py2.7-core

00:00:38

passed #827
py3.6-core

00:00:38

passed #828
py3.7-core

00:00:38

passed #829
py3.8-core

00:00:36

passed #830
py3.9-core

00:00:38

failed #831
allowed to fail
py3.9-download

00:20:38

 
Name Stage Failure
failed
py3.9-download Test

--------------------- >> end captured stdout << ----------------------

----------------------------------------------------------------------
Ran 2146 tests in 1208.435s

FAILED (errors=940, failures=267)
Cleaning up file based variables
ERROR: Job failed: exit code 1
failed
jython-core Test
    raise _map_exception(jlx)
error: [Errno -1] Unmapped exception: java.security.KeyStoreException: Key protection algorithm not found: java.security.KeyStoreException: Certificate chain is not valid

----------------------------------------------------------------------
Ran 172 tests in 83.358s

FAILED (errors=2)
Cleaning up file based variables
ERROR: Job failed: exit code 1