version 2020.12.11

7 jobs for master in 21 minutes and 5 seconds (queued for 2 seconds)
Status Job ID Name Coverage
  Test
failed #1209
allowed to fail
jython-core

00:02:23

passed #1203
py2.7-core

00:00:34

passed #1204
py3.6-core

00:00:33

passed #1205
py3.7-core

00:00:33

passed #1206
py3.8-core

00:00:32

passed #1207
py3.9-core

00:00:33

failed #1208
allowed to fail
py3.9-download

00:21:04

 
Name Stage Failure
failed
py3.9-download Test

--------------------- >> end captured stdout << ----------------------

----------------------------------------------------------------------
Ran 2160 tests in 1235.029s

FAILED (errors=941, failures=273)
Cleaning up file based variables
ERROR: Job failed: exit code 1
failed
jython-core Test
    raise _map_exception(jlx)
error: [Errno -1] Unmapped exception: java.security.KeyStoreException: Key protection algorithm not found: java.security.KeyStoreException: Certificate chain is not valid

----------------------------------------------------------------------
Ran 172 tests in 85.928s

FAILED (errors=2)
Cleaning up file based variables
ERROR: Job failed: exit code 1