version 2021.01.03

7 jobs for master in 23 minutes and 22 seconds (queued for 2 seconds)
Status Job ID Name Coverage
  Test
failed #1402
allowed to fail
jython-core

00:02:26

passed #1396
py2.7-core

00:00:34

passed #1397
py3.6-core

00:00:33

passed #1398
py3.7-core

00:00:33

passed #1399
py3.8-core

00:00:33

passed #1400
py3.9-core

00:00:34

failed #1401
allowed to fail
py3.9-download

00:23:21

 
Name Stage Failure
failed
py3.9-download Test

--------------------- >> end captured stdout << ----------------------

----------------------------------------------------------------------
Ran 2171 tests in 1374.389s

FAILED (errors=941, failures=269)
Cleaning up file based variables
ERROR: Job failed: exit code 1
failed
jython-core Test
    raise _map_exception(jlx)
error: [Errno -1] Unmapped exception: java.security.KeyStoreException: Key protection algorithm not found: java.security.KeyStoreException: Certificate chain is not valid

----------------------------------------------------------------------
Ran 172 tests in 85.193s

FAILED (errors=2)
Cleaning up file based variables
ERROR: Job failed: exit code 1