version 2021.01.16

7 jobs for master in 23 minutes and 5 seconds (queued for 3 seconds)
Status Job ID Name Coverage
  Test
failed #1479
allowed to fail
jython-core

00:02:44

passed #1473
py2.7-core

00:00:38

passed #1474
py3.6-core

00:00:37

passed #1475
py3.7-core

00:00:34

passed #1476
py3.8-core

00:00:34

passed #1477
py3.9-core

00:00:38

failed #1478
allowed to fail
py3.9-download

00:23:04

 
Name Stage Failure
failed
py3.9-download Test

--------------------- >> end captured stdout << ----------------------

----------------------------------------------------------------------
Ran 2189 tests in 1352.218s

FAILED (errors=943, failures=271)
Cleaning up file based variables
ERROR: Job failed: exit code 1
failed
jython-core Test
    raise _map_exception(jlx)
error: [Errno -1] Unmapped exception: java.security.KeyStoreException: Key protection algorithm not found: java.security.KeyStoreException: Certificate chain is not valid

----------------------------------------------------------------------
Ran 172 tests in 95.853s

FAILED (errors=2)
Cleaning up file based variables
ERROR: Job failed: exit code 1