version 2021.01.24

7 jobs for v2021.01.24 in 22 minutes and 51 seconds
latest
Status Job ID Name Coverage
  Test
failed #1588
allowed to fail
jython-core

00:03:25

passed #1582
py2.7-core

00:00:50

passed #1583
py3.6-core

00:00:50

passed #1584
py3.7-core

00:00:50

passed #1585
py3.8-core

00:00:50

passed #1586
py3.9-core

00:00:48

failed #1587
allowed to fail
py3.9-download

00:22:50

 
Name Stage Failure
failed
py3.9-download Test

--------------------- >> end captured stdout << ----------------------

----------------------------------------------------------------------
Ran 2200 tests in 1334.318s

FAILED (errors=944, failures=262)
Cleaning up file based variables
ERROR: Job failed: exit code 1
failed
jython-core Test
    raise _map_exception(jlx)
error: [Errno -1] Unmapped exception: java.security.KeyStoreException: Key protection algorithm not found: java.security.KeyStoreException: Certificate chain is not valid

----------------------------------------------------------------------
Ran 175 tests in 117.633s

FAILED (errors=2)
Cleaning up file based variables
ERROR: Job failed: exit code 1