version 2020.11.12

7 jobs for v2020.11.12 in 18 minutes and 36 seconds (queued for 1 minute and 19 seconds)
latest
Status Job ID Name Coverage
  Test
failed #1635
allowed to fail
jython-core

00:04:19

passed #1629
py2.7-core

00:00:56

passed #1630
py3.6-core

00:00:57

passed #1631
py3.7-core

00:00:52

passed #1632
py3.8-core

00:00:54

passed #1633
py3.9-core

00:00:54

failed #1634
allowed to fail
py3.9-download

00:18:32

 
Name Stage Failure
failed
py3.9-download Test

--------------------- >> end captured stdout << ----------------------

----------------------------------------------------------------------
Ran 2167 tests in 1074.826s

FAILED (errors=1021, failures=253)
Cleaning up file based variables
ERROR: Job failed: exit code 1
failed
jython-core Test
    raise _map_exception(jlx)
error: [Errno -1] Unmapped exception: java.security.KeyStoreException: Key protection algorithm not found: java.security.KeyStoreException: Certificate chain is not valid

----------------------------------------------------------------------
Ran 177 tests in 141.323s

FAILED (errors=2)
Cleaning up file based variables
ERROR: Job failed: exit code 1