version 2021.02.26

7 jobs for v2021.02.26 in 21 minutes and 55 seconds (queued for 2 seconds)
latest
Status Job ID Name Coverage
  Test
failed #1930
playwright-tests-core

00:00:32

passed #1931
playwright-tests-download

00:00:15

failed #1925
py3.6-core

00:00:40

failed #1926
py3.7-core

00:00:37

failed #1927
py3.8-core

00:00:38

failed #1928
py3.9-core

00:00:38

failed #1929
allowed to fail
py3.9-download

00:21:54

 
Name Stage Failure
failed
py3.9-download Test

--------------------- >> end captured stdout << ----------------------

----------------------------------------------------------------------
Ran 2269 tests in 1282.690s

FAILED (errors=827, failures=296)
Cleaning up file based variables
ERROR: Job failed: exit code 1
failed
py3.6-core Test
    self.assertTrue(m, msg)
AssertionError: None is not true : Regexp didn't match: '(?:(?:#.*?|\\s*)\\n)*from __future__ import (?:[a-z_]+,\\s*)*unicode_literals' not found, unicode_literals import missing in /builds/laudompat/haruhi-dl/haruhi_dl/__init__.py

----------------------------------------------------------------------
Ran 178 tests in 24.198s

FAILED (failures=1)
Cleaning up file based variables
ERROR: Job failed: exit code 1
failed
py3.9-core Test
    self.assertTrue(m, msg)
AssertionError: None is not true : Regexp didn't match: '(?:(?:#.*?|\\s*)\\n)*from __future__ import (?:[a-z_]+,\\s*)*unicode_literals' not found, unicode_literals import missing in /builds/laudompat/haruhi-dl/haruhi_dl/__init__.py

----------------------------------------------------------------------
Ran 178 tests in 22.008s

FAILED (failures=1)
Cleaning up file based variables
ERROR: Job failed: exit code 1
failed
py3.8-core Test
    self.assertTrue(m, msg)
AssertionError: None is not true : Regexp didn't match: '(?:(?:#.*?|\\s*)\\n)*from __future__ import (?:[a-z_]+,\\s*)*unicode_literals' not found, unicode_literals import missing in /builds/laudompat/haruhi-dl/haruhi_dl/__init__.py

----------------------------------------------------------------------
Ran 178 tests in 21.704s

FAILED (failures=1)
Cleaning up file based variables
ERROR: Job failed: exit code 1
failed
py3.7-core Test
    self.assertTrue(m, msg)
AssertionError: None is not true : Regexp didn't match: '(?:(?:#.*?|\\s*)\\n)*from __future__ import (?:[a-z_]+,\\s*)*unicode_literals' not found, unicode_literals import missing in /builds/laudompat/haruhi-dl/haruhi_dl/__init__.py

----------------------------------------------------------------------
Ran 178 tests in 22.273s

FAILED (failures=1)
Cleaning up file based variables
ERROR: Job failed: exit code 1
failed
playwright-tests-core Test
    self.assertTrue(m, msg)
AssertionError: None is not true : Regexp didn't match: '(?:(?:#.*?|\\s*)\\n)*from __future__ import (?:[a-z_]+,\\s*)*unicode_literals' not found, unicode_literals import missing in /builds/laudompat/haruhi-dl/haruhi_dl/__init__.py

----------------------------------------------------------------------
Ran 178 tests in 17.295s

FAILED (failures=1)
Cleaning up file based variables
ERROR: Job failed: exit code 1