version 2020.11.08

12 jobs for v2020.11.08 in 60 minutes and 38 seconds (queued for 2 seconds)
latest
Status Job ID Name Coverage
  Test
failed #568
allowed to fail
jython-core

00:02:48

failed #569
allowed to fail
jython-download

01:00:00

passed #558
py2.7-core

00:00:37

failed #559
allowed to fail
py2.7-download

00:18:21

passed #560
py3.6-core

00:00:37

failed #561
allowed to fail
py3.6-download

00:19:06

passed #562
py3.7-core

00:00:36

failed #563
allowed to fail
py3.7-download

00:18:55

passed #564
py3.8-core

00:00:37

failed #565
allowed to fail
py3.8-download

00:19:03

passed #566
py3.9-core

00:00:37

failed #567
allowed to fail
py3.9-download

00:18:33

 
Name Stage Failure
failed
jython-download Test The script exceeded the maximum execution time set for the job
test_Smotri_4 (test.test_download.TestDownload): ... ok
test_Smotri_5 (test.test_download.TestDownload): ... ERROR
test_Smotri_6 (test.test_download.TestDownload): ... ERROR
test_Snotr (test.test_download.TestDownload): ... ok
test_Snotr_1 (test.test_download.TestDownload): ... ok
test_Sohu (test.test_download.TestDownload): ... ok
test_Sohu_1 (test.test_download.TestDownload): ... ERROR
test_Sohu_2 (test.test_download.TestDownload): ... ok
test_Sohu_3 (test.test_download.TestDownload): ...
ERROR: Job failed: execution took longer than 1h0m0s seconds
failed
py3.6-download Test
WARNING: test_Unistra failed due to network errors, skipping...
WARNING: test_VShare failed due to network errors, skipping...

----------------------------------------------------------------------
Ran 2162 tests in 1113.614s

FAILED (errors=958, failures=275)
Cleaning up file based variables
ERROR: Job failed: exit code 1
failed
py3.8-download Test

--------------------- >> end captured stdout << ----------------------

----------------------------------------------------------------------
Ran 2162 tests in 1111.814s

FAILED (errors=951, failures=274)
Cleaning up file based variables
ERROR: Job failed: exit code 1
failed
py3.7-download Test

--------------------- >> end captured stdout << ----------------------

----------------------------------------------------------------------
Ran 2162 tests in 1104.188s

FAILED (errors=948, failures=273)
Cleaning up file based variables
ERROR: Job failed: exit code 1
failed
py3.9-download Test

--------------------- >> end captured stdout << ----------------------

----------------------------------------------------------------------
Ran 2162 tests in 1081.916s

FAILED (errors=945, failures=274)
Cleaning up file based variables
ERROR: Job failed: exit code 1
failed
py2.7-download Test

--------------------- >> end captured stdout << ----------------------

----------------------------------------------------------------------
Ran 2162 tests in 1075.124s

FAILED (errors=967, failures=271)
Cleaning up file based variables
ERROR: Job failed: exit code 1
failed
jython-core Test
    raise _map_exception(jlx)
error: [Errno -1] Unmapped exception: java.security.KeyStoreException: Key protection algorithm not found: java.security.KeyStoreException: Certificate chain is not valid

----------------------------------------------------------------------
Ran 177 tests in 100.839s

FAILED (errors=2)
Cleaning up file based variables
ERROR: Job failed: exit code 1